Target
Melanocyte-stimulating hormone receptor
Ligand
BDBM50184359
Substrate
Meas. Tech.
ChEMBL_338131 (CHEMBL867658)
IC50
0.200000±n/a nM
Citation
 Mayorov, AVCai, MChandler, KBPetrov, RRVan Scoy, ARYu, ZTanaka, DKTrivedi, DHruby, VJ Development of cyclic gamma-MSH analogues with selective hMC3R agonist and hMC3R/hMC5R antagonist activities. J Med Chem 49:1946-52 (2006)  
Target
Name:
Melanocyte-stimulating hormone receptor
Synonyms:
MC1-R MSH-R MSHR_HUMAN Melanocortin receptor (M1 and M4) Melanocortin receptor 1 (MC1-R) | Melanocortin receptor 1 (MC1R)
Type:
Enzyme
Mol. Mass.:
34717.23
Organism:
Homo sapiens (Human)
Description:
Q01726
Residue:
317
  
Inhibitor
Name:
BDBM50184359
Synonyms:
(3S,6S,9R,12S,15S,23S)-15-((S)-2-acetylamino-hexanoylamino)-9-benzyl-6-(3-guanidino-propyl)-12-(3H-imidazol-4-ylmethyl)-3-(1H-indol-3-ylmethyl)-2,5,8,11,14,17-hexaoxo-1,4,7,10,13,18hexaaza-cyclotricosane-23-carboxylic acid amide Ac-Nle-c[Asp-His-DPhe-Arg-Trp-Lys]-NH2 MT-II | ebi_340792
Type:
Small organic molecule
Emp. Form.:
C50H69N15O9
Mol. Mass.:
1024.178
SMILES:
CCCC[C@H](NC(C)=O)C(=O)N[C@H]1CC(=O)NCCCC[C@H](NC(=O)[C@H](Cc2c[nH]c3ccccc23)NC(=O)[C@H](CCCN=C(N)N)NC(=O)[C@@H](Cc2ccccc2)NC(=O)[C@H](Cc2cnc[nH]2)NC1=O)C(N)=O
: