Target
Protein kinase C alpha type
Ligand
BDBM50184394
Substrate
Meas. Tech.
ChEMBL_338717 (CHEMBL860607)
Ki
48±n/a nM
Citation
 Lee, JKang, JHHan, KCKim, YKim, SYYoun, HSMook-Jung, IKim, HLo Han, JHHa, HJKim, YHMarquez, VELewin, NEPearce, LVLundberg, DJBlumberg, PM Branched diacylglycerol-lactones as potent protein kinase C ligands and alpha-secretase activators. J Med Chem 49:2028-36 (2006)  
Target
Name:
Protein kinase C alpha type
Synonyms:
KPCA_HUMAN PKC alpha and beta-2 PKC-alpha PRKACA Protein Kinase C- alpha Protein kinase C alpha (PKCa) Protein kinase C alpha type (PRKCA) RAF proto-oncogene serine/threonine-protein kinase
Type:
Enzyme
Mol. Mass.:
76755.65
Organism:
Homo sapiens (Human)
Description:
The recombinant human PKC enzymes were produced using a baculovirus expression system in SF9 cells
Residue:
672
  
Inhibitor
Name:
BDBM50184394
Synonyms:
6-hydroxymethyl-3-[(E)-3-isobutyl-5-methylhexylidene]-6-pivaloyloxymethyl-tetrahydro-2-pyranone | CHEMBL205619
Type:
Small organic molecule
Emp. Form.:
C23H40O5
Mol. Mass.:
396.5607
SMILES:
CC(C)CC(C\C=C1/CCC(CO)(COC(=O)C(C)(C)C)OC1=O)CC(C)C
: