Target
D(3) dopamine receptor
Ligand
BDBM50184428
Substrate
Meas. Tech.
ChEMBL_337503 (CHEMBL861437)
Ki
24.6±n/a nM
Citation
 Mohr, PDecker, MEnzensperger, CLehmann, J Dopamine/serotonin receptor ligands. 12(1): SAR studies on hexahydro-dibenz[d,g]azecines lead to 4-chloro-7-methyl-5,6,7,8,9,14-hexahydrodibenz[d,g]azecin-3-ol, the first picomolar D5-selective dopamine-receptor antagonist. J Med Chem 49:2110-6 (2006)  
Target
Name:
D(3) dopamine receptor
Synonyms:
DOPAMINE D3 DRD3_HUMAN Dopamine D3 receptor (D3) Dopamine receptor Dopamine receptor D3
Type:
Mol. Mass.:
44243.43
Organism:
Homo sapiens (Human)
Description:
Residue:
400
  
Inhibitor
Name:
BDBM50184428
Synonyms:
4-Chloro-3-hydroxy-7-methyl-5,6,7,8,9,14-hexahydrodibenzo[d,g]azecine CHEMBL203637
Type:
Small organic molecule
Emp. Form.:
C18H20ClNO
Mol. Mass.:
301.811
SMILES:
CN1CCc2ccccc2Cc2ccc(O)c(Cl)c2CC1
: