Target
Dimer of Tryptase beta-2
Ligand
BDBM50184508
Substrate
Meas. Tech.
ChEMBL_365130 (CHEMBL867493)
IC50
130±n/a nM
Citation
 Miyazaki, YKato, YManabe, TShimada, HMizuno, MEgusa, TOhkouchi, MShiromizu, IMatsusue, TYamamoto, I Synthesis and evaluation of 4-substituted benzylamine derivatives as beta-tryptase inhibitors. Bioorg Med Chem Lett 16:2986-90 (2006)  
Target
Name:
Dimer of Tryptase beta-2
Synonyms:
Tryptase beta-1/beta-2
Type:
Mol. Mass.:
Description:
ASSAY_ID of EBI is 365130
Components:
This complex has 2 components.
Component 1
Name:
Tryptase beta-2
Synonyms:
TPS2 TRYB2_HUMAN Tryptase II Tryptase-2
Type:
PROTEIN
Mol. Mass.:
30518.79
Organism:
Homo sapiens (Human)
Description:
ChEMBL_210702
Residue:
275
  
Component 2
Name:
Tryptase beta-2
Synonyms:
TPS2 TRYB2_HUMAN Tryptase II Tryptase-2
Type:
PROTEIN
Mol. Mass.:
30518.79
Organism:
Homo sapiens (Human)
Description:
ChEMBL_210702
Residue:
275
  
Inhibitor
Name:
BDBM50184508
Synonyms:
CHEMBL207193 | N-(2-(3-(4-(aminomethyl)phenyl)propylamino)ethyl)benzo[b]thiophene-2-sulfonamide
Type:
Small organic molecule
Emp. Form.:
C20H25N3O2S2
Mol. Mass.:
403.561
SMILES:
NCc1ccc(CCCNCCNS(=O)(=O)c2cc3ccccc3s2)cc1
: