Target
C-X-C chemokine receptor type 2
Ligand
BDBM50184540
Substrate
Meas. Tech.
ChEMBL_355078 (CHEMBL870125)
Ki
35±n/a nM
Citation
 Ho, KKAuld, DSBohnstedt, ACConti, PDokter, WErickson, SFeng, DInglese, JKingsbury, CKultgen, SGLiu, RQMasterson, CMOhlmeyer, MRong, YRooseboom, MRoughton, ASamama, PSmit, MJSon, Evan der Louw, JVogel, GWebb, MWijkmans, JYou, M Imidazolylpyrimidine based CXCR2 chemokine receptor antagonists. Bioorg Med Chem Lett 16:2724-8 (2006)  
Target
Name:
C-X-C chemokine receptor type 2
Synonyms:
C-X-C chemokine receptor type 2 (CXCR-2) CD_antigen=CD182 CXCR-2 CXCR2_HUMAN GRO/MGSA receptor IL-8 receptor type 2 IL8RB | Interleukin-8 receptor B
Type:
Protein
Mol. Mass.:
40767.88
Organism:
Homo sapiens (Human)
Description:
P25025
Residue:
360
  
Inhibitor
Name:
BDBM50184540
Synonyms:
(2S)-N-(3-ethoxypropyl)-4-methyl-2-(6-propyl-2-(4-(3-(trifluoromethoxy)phenyl)-1H-imidazol-1-yl)pyrimidin-4-ylamino)pentanamide | CHEMBL207856
Type:
Small organic molecule
Emp. Form.:
C28H37F3N6O3
Mol. Mass.:
562.627
SMILES:
CCCc1cc(N[C@@H](CC(C)C)C(=O)NCCCOCC)nc(n1)-n1cnc(c1)-c1cccc(OC(F)(F)F)c1
: