Target
Urokinase-type plasminogen activator
Ligand
BDBM50184648
Substrate
Meas. Tech.
ChEBML_355567
IC50
26±n/a nM
Citation
 Sienczyk, MOleksyszyn, J Inhibition of trypsin and urokinase by Cbz-amino(4-guanidinophenyl)methanephosphonate aromatic ester derivatives: the influence of the ester group on their biological activity. Bioorg Med Chem Lett 16:2886-90 (2006)  
Target
Name:
Urokinase-type plasminogen activator
Synonyms:
PLAU UROK_HUMAN Urokinase-type plasminogen activator (uPA) | Urokinase-type plasminogen activator/surface receptor
Type:
Enzyme
Mol. Mass.:
48528.62
Organism:
Homo sapiens (Human)
Description:
P00749
Residue:
431
  
Inhibitor
Name:
BDBM50184648
Synonyms:
CHEMBL378976 | [benzyloxycarbonylamino-(4-guanidino-phenyl)-methyl]-phosphonic acid bis-(4-methylsulfanyl-phenyl) ester trifluoro-acetic acid salt
Type:
Small organic molecule
Emp. Form.:
C30H31N4O5PS2
Mol. Mass.:
622.695
SMILES:
[#6]-[#16]-c1ccc(-[#8]P(=O)([#8]-c2ccc(-[#16]-[#6])cc2)[#6](-[#7]-[#6](=O)-[#8]-[#6]-c2ccccc2)-c2ccc(cc2)\[#7]=[#6](\[#7])-[#7])cc1
: