Target
DNA polymerase alpha catalytic subunit
Ligand
BDBM50184754
Substrate
Meas. Tech.
ChEMBL_356787 (CHEMBL861140)
IC50
3700±n/a nM
Citation
 Doncaster, JREtchells, LLKershaw, NMNakamura, RRyan, HTakeuchi, RSakaguchi, KSardarian, AWhitehead, RC Synthetic analogues of the manzamenones and plakoridines which inhibit DNA polymerase. Bioorg Med Chem Lett 16:2877-81 (2006)  
Target
Name:
DNA polymerase alpha catalytic subunit
Synonyms:
DNA polymerase (alpha/delta/epsilon) DPOLA_HUMAN POLA1
Type:
PROTEIN
Mol. Mass.:
165895.25
Organism:
Homo sapiens (Human)
Description:
ChEMBL_1365493
Residue:
1462
  
Inhibitor
Name:
BDBM50184754
Synonyms:
(E)-methyl-3,6-dioxo-4-docosenoate | CHEMBL425779
Type:
Small organic molecule
Emp. Form.:
C23H40O4
Mol. Mass.:
380.5613
SMILES:
CCCCCCCCCCCCCCCCC(=O)C=CC(=O)CC(=O)OC
: