Target
DNA polymerase beta
Ligand
BDBM50184754
Substrate
Meas. Tech.
ChEMBL_356788 (CHEMBL861141)
IC50
8800±n/a nM
Citation
 Doncaster, JREtchells, LLKershaw, NMNakamura, RRyan, HTakeuchi, RSakaguchi, KSardarian, AWhitehead, RC Synthetic analogues of the manzamenones and plakoridines which inhibit DNA polymerase. Bioorg Med Chem Lett 16:2877-81 (2006)  
Target
Name:
DNA polymerase beta
Synonyms:
DNA polymerase beta (Pol β) POLB
Type:
Protein
Mol. Mass.:
38188.76
Organism:
Homo sapiens (Human)
Description:
Residue:
335
  
Inhibitor
Name:
BDBM50184754
Synonyms:
(E)-methyl-3,6-dioxo-4-docosenoate | CHEMBL425779
Type:
Small organic molecule
Emp. Form.:
C23H40O4
Mol. Mass.:
380.5613
SMILES:
CCCCCCCCCCCCCCCCC(=O)C=CC(=O)CC(=O)OC
: