Target
DNA nucleotidylexotransferase
Ligand
BDBM50184758
Substrate
Meas. Tech.
ChEMBL_356789 (CHEMBL861142)
IC50
8600±n/a nM
Citation
 Doncaster, JREtchells, LLKershaw, NMNakamura, RRyan, HTakeuchi, RSakaguchi, KSardarian, AWhitehead, RC Synthetic analogues of the manzamenones and plakoridines which inhibit DNA polymerase. Bioorg Med Chem Lett 16:2877-81 (2006)  
Target
Name:
DNA nucleotidylexotransferase
Synonyms:
DNA nucleotidylexotransferase TDT Terminal addition enzyme Terminal transferase
Type:
PROTEIN
Mol. Mass.:
58545.66
Organism:
Homo sapiens (Human)
Description:
ChEMBL_210231
Residue:
509
  
Inhibitor
Name:
BDBM50184758
Synonyms:
(3aS,4S,7R,7aR)-1,6-didodecyl-2,7-bis(methoxycarbonyl)-3-oxo-3a,4,7,7a-tetrahydro-3H-indene-4-carboxylic acid | CHEMBL210047
Type:
Small organic molecule
Emp. Form.:
C38H62O7
Mol. Mass.:
630.8947
SMILES:
CCCCCCCCCCCCC1=C(C(=O)OC)C(=O)[C@H]2[C@@H]1[C@@H](C(=O)OC)C(CCCCCCCCCCCC)=C[C@@H]2C(O)=O
: