Target
DNA nucleotidylexotransferase
Ligand
BDBM50184761
Substrate
Meas. Tech.
ChEMBL_356789 (CHEMBL861142)
IC50
>12500±n/a nM
Citation
 Doncaster, JREtchells, LLKershaw, NMNakamura, RRyan, HTakeuchi, RSakaguchi, KSardarian, AWhitehead, RC Synthetic analogues of the manzamenones and plakoridines which inhibit DNA polymerase. Bioorg Med Chem Lett 16:2877-81 (2006)  
Target
Name:
DNA nucleotidylexotransferase
Synonyms:
DNA nucleotidylexotransferase TDT Terminal addition enzyme Terminal transferase
Type:
PROTEIN
Mol. Mass.:
58545.66
Organism:
Homo sapiens (Human)
Description:
ChEMBL_210231
Residue:
509
  
Inhibitor
Name:
BDBM50184761
Synonyms:
(3aR,4R,7S,7aS)-dimethyl 3,5-dihexadecyl-1-oxo-7-(phenethylcarbamoyl)-3a,4,7,7a-tetrahydro-1H-indene-2,4-dicarboxylate | CHEMBL207651
Type:
Small organic molecule
Emp. Form.:
C54H87NO6
Mol. Mass.:
846.2717
SMILES:
CCCCCCCCCCCCCCCCC1=C(C(=O)OC)C(=O)[C@H]2[C@@H]1[C@@H](C(=O)OC)C(CCCCCCCCCCCCCCCC)=C[C@@H]2C(=O)NCCc1ccccc1
: