Target
Platelet-derived growth factor receptor beta
Ligand
BDBM50185169
Substrate
Meas. Tech.
ChEMBL_374543 (CHEMBL862850)
IC50
8±n/a nM
Citation
 McBride, CMRenhowe, PAHeise, CJansen, JMLapointe, GMa, SPiñeda, RVora, JWiesmann, MShafer, CM Design and structure-activity relationship of 3-benzimidazol-2-yl-1H-indazoles as inhibitors of receptor tyrosine kinases. Bioorg Med Chem Lett 16:3595-9 (2006)  
Target
Name:
Platelet-derived growth factor receptor beta
Synonyms:
2.7.10.1 Beta-type platelet-derived growth factor receptor CD140b antigen PDGF-R-beta PDGFR-beta Pdgfr Pdgfrb Platelet-derived growth factor receptor | Platelet-derived growth factor receptor 1
Type:
Enzyme
Mol. Mass.:
122771.00
Organism:
Mus musculus (mouse)
Description:
P05622
Residue:
1098
  
Inhibitor
Name:
BDBM50185169
Synonyms:
2-(5-phenoxy-1H-indazol-3-yl)-5-(4-(piperidin-1-yl)piperidin-1-yl)-1H-benzo[d]imidazole | CHEMBL211662
Type:
Small organic molecule
Emp. Form.:
C30H32N6O
Mol. Mass.:
492.6147
SMILES:
C1CCN(CC1)C1CCN(CC1)c1ccc2nc([nH]c2c1)-c1n[nH]c2ccc(Oc3ccccc3)cc12
: