Target
Vascular endothelial growth factor receptor 2
Ligand
BDBM50185184
Substrate
Meas. Tech.
ChEMBL_374541 (CHEMBL862848)
IC50
21±n/a nM
Citation
 McBride, CMRenhowe, PAHeise, CJansen, JMLapointe, GMa, SPiñeda, RVora, JWiesmann, MShafer, CM Design and structure-activity relationship of 3-benzimidazol-2-yl-1H-indazoles as inhibitors of receptor tyrosine kinases. Bioorg Med Chem Lett 16:3595-9 (2006)  
Target
Name:
Vascular endothelial growth factor receptor 2
Synonyms:
Flk-1 Kdr VGFR2_MOUSE | Vascular endothelial growth factor receptor 2
Type:
PROTEIN
Mol. Mass.:
152506.58
Organism:
Mus musculus
Description:
ChEMBL_1469997
Residue:
1367
  
Inhibitor
Name:
BDBM50185184
Synonyms:
2-(6-(benzyloxy)-1H-indazol-3-yl)-5-(4-(piperidin-1-yl)piperidin-1-yl)-1H-benzo[d]imidazole | CHEMBL209704
Type:
Small organic molecule
Emp. Form.:
C31H34N6O
Mol. Mass.:
506.6413
SMILES:
C(Oc1ccc2c(n[nH]c2c1)-c1nc2ccc(cc2[nH]1)N1CCC(CC1)N1CCCCC1)c1ccccc1
: