Target
Glutamate receptor ionotropic, kainate 5
Ligand
BDBM50185323
Substrate
Meas. Tech.
ChEMBL_341792 (CHEMBL861532)
Kd
5800±n/a nM
Citation
 Dolman, NPMore, JCAlt, AKnauss, JLTroop, HMBleakman, DCollingridge, GLJane, DE Structure-activity relationship studies on N3-substituted willardiine derivatives acting as AMPA or kainate receptor antagonists. J Med Chem 49:2579-92 (2006)  
Target
Name:
Glutamate receptor ionotropic, kainate 5
Synonyms:
GRIK5_RAT Grik5
Type:
PROTEIN
Mol. Mass.:
109291.75
Organism:
Rattus norvegicus
Description:
ChEMBL_487966
Residue:
979
  
Inhibitor
Name:
BDBM50185323
Synonyms:
(RS)-1-(2-amino-2-carboxyethyl)-3-(4-phosphonobenzyl)pyrimidine-2,4-dione | CHEMBL382774
Type:
Small organic molecule
Emp. Form.:
C14H16N3O7P
Mol. Mass.:
369.2665
SMILES:
NC(Cn1ccc(=O)n(Cc2ccc(cc2)P(O)(O)=O)c1=O)C(O)=O
: