Target
Cytosolic phospholipase A2
Ligand
BDBM50185355
Substrate
Meas. Tech.
ChEMBL_341906 (CHEMBL863829)
IC50
120±n/a nM
Citation
 Ludwig, JBovens, SBrauch, CElfringhoff, ASLehr, M Design and synthesis of 1-indol-1-yl-propan-2-ones as inhibitors of human cytosolic phospholipase A2alpha. J Med Chem 49:2611-20 (2006)  
Target
Name:
Cytosolic phospholipase A2
Synonyms:
CPLA2 PA24A_HUMAN PLA2G4A Phospholipase A2 | Phospholipase A2 group IVA
Type:
Protein
Mol. Mass.:
85219.30
Organism:
Homo sapiens (Human)
Description:
P47712
Residue:
749
  
Inhibitor
Name:
BDBM50185355
Synonyms:
1-(3-(4-octylphenoxy)-2-oxopropyl)-1H-indole-5-carboxamide CHEMBL204302
Type:
Small organic molecule
Emp. Form.:
C26H32N2O3
Mol. Mass.:
420.5439
SMILES:
CCCCCCCCc1ccc(OCC(=O)Cn2ccc3cc(ccc23)C(N)=O)cc1
: