Target
Cytosolic phospholipase A2
Ligand
BDBM50110846
Substrate
Meas. Tech.
ChEMBL_341908 (CHEMBL863831)
IC50
250±n/a nM
Citation
 Ludwig, JBovens, SBrauch, CElfringhoff, ASLehr, M Design and synthesis of 1-indol-1-yl-propan-2-ones as inhibitors of human cytosolic phospholipase A2alpha. J Med Chem 49:2611-20 (2006)  
Target
Name:
Cytosolic phospholipase A2
Synonyms:
CPLA2 PA24A_HUMAN PLA2G4A Phospholipase A2 | Phospholipase A2 group IVA
Type:
Protein
Mol. Mass.:
85219.30
Organism:
Homo sapiens (Human)
Description:
P47712
Residue:
749
  
Inhibitor
Name:
BDBM50110846
Synonyms:
4-(3-(4-(decyloxy)phenoxy)-2-oxopropoxy)benzoic acid 4-[3-(4-Decyloxy-phenoxy)-2-oxo-propoxy]-benzoic acid(AR-C70484XX) | CHEMBL30108
Type:
Small organic molecule
Emp. Form.:
C26H34O6
Mol. Mass.:
442.5446
SMILES:
CCCCCCCCCCOc1ccc(OCC(=O)COc2ccc(cc2)C(O)=O)cc1
: