Target
1-deoxy-D-xylulose 5-phosphate reductoisomerase
Ligand
BDBM50153713
Substrate
Meas. Tech.
ChEMBL_344886 (CHEMBL870710)
IC50
48±n/a nM
Citation
 Devreux, VWiesner, JGoeman, JLVan der Eycken, JJomaa, HVan Calenbergh, S Synthesis and biological evaluation of cyclopropyl analogues of fosmidomycin as potent Plasmodium falciparum growth inhibitors. J Med Chem 49:2656-60 (2006)  
Target
Name:
1-deoxy-D-xylulose 5-phosphate reductoisomerase
Synonyms:
1-Deoxy-D-xylulose 5-phosphate reductoisomerase (DXP) 1-deoxy-D-xylulose 5-phosphate reductoisomerase (DXR) DXP reductoisomerase dxr yaeM
Type:
Protein
Mol. Mass.:
43384.52
Organism:
Escherichia coli
Description:
P45568
Residue:
398
  
Inhibitor
Name:
BDBM50153713
Synonyms:
3-(N-hydroxyformamido)propylphosphonic acid CHEMBL203125 fosmidomycin
Type:
Small organic molecule
Emp. Form.:
C4H10NO5P
Mol. Mass.:
183.0997
SMILES:
ON(CCCP(O)(O)=O)C=O
: