Target
Integrin alpha-V/beta-3
Ligand
BDBM50185459
Substrate
Meas. Tech.
ChEMBL_360911 (CHEMBL870872)
IC50
0.58±n/a nM
Citation
 Penning, TDKhilevich, AChen, BBRussell, MABoys, MLWang, YDuffin, TEngleman, VWFinn, MBFreeman, SKHanneke, MLKeene, JLKlover, JANickols, GANickols, MARader, RKSettle, SLShannon, KESteininger, CNWestlin, MMWestlin, WF Synthesis of pyrazoles and isoxazoles as potent alpha(v)beta3 receptor antagonists. Bioorg Med Chem Lett 16:3156-61 (2006)  
Target
Name:
Integrin alpha-V/beta-3
Synonyms:
ITGAV/ITGB3 | Integrin beta-3/Vitronectin receptor alpha
Type:
Enzyme
Mol. Mass.:
Description:
Components:
This complex has 2 components.
Component 1
Name:
Integrin alpha-V
Synonyms:
ITAV_HUMAN Integrin alpha-V/alpha-5 VNRA Vitronectin receptor | Vitronectin receptor subunit alpha
Type:
PROTEIN
Mol. Mass.:
116024.92
Organism:
Homo sapiens (Human)
Description:
ChEMBL_582336
Residue:
1048
  
Component 2
Name:
Integrin beta-3
Synonyms:
CD_antigen=CD61 GPIIIa ITGB3 Platelet membrane glycoprotein IIIa
Type:
Protein
Mol. Mass.:
87038.91
Organism:
Homo sapiens (Human)
Description:
P05106
Residue:
788
  
Inhibitor
Name:
BDBM50185459
Synonyms:
3-(benzo[d][1,3]dioxol-5-yl)-4-(3-(3-(4,5-dihydro-1H-imidazol-2-ylamino)propoxy)isoxazol-5-yl)butanoic acid | CHEMBL382996
Type:
Small organic molecule
Emp. Form.:
C20H24N4O6
Mol. Mass.:
416.4278
SMILES:
[#8]-[#6](=O)-[#6]-[#6](-[#6]-c1cc(-[#8]-[#6]-[#6]-[#6]\[#7]=[#6]-2\[#7]-[#6]-[#6]-[#7]-2)no1)-c1ccc2-[#8]-[#6]-[#8]-c2c1
: