Target
C-C chemokine receptor type 5
Ligand
BDBM50185673
Substrate
Meas. Tech.
ChEMBL_372909 (CHEMBL865374)
IC50
0.76±n/a nM
Citation
 Cumming, JGBrown, SJCooper, AEFaull, AWFlynn, APGrime, KOldfield, JShaw, JSShepherd, ETucker, HWhittaker, D Modulators of the human CCR5 receptor. Part 3: SAR of substituted 1-[3-(4-methanesulfonylphenyl)-3-phenylpropyl]-piperidinyl phenylacetamides. Bioorg Med Chem Lett 16:3533-6 (2006)  
Target
Name:
C-C chemokine receptor type 5
Synonyms:
C-C CKR-5 CC-CKR-5 CCR5 CCR5_HUMAN CHEMR13 HIV-1 fusion coreceptor
Type:
Enzyme
Mol. Mass.:
40540.21
Organism:
Homo sapiens (Human)
Description:
P51681
Residue:
352
  
Inhibitor
Name:
BDBM50185673
Synonyms:
(S)-N-ethyl-2-(4-(methylsulfonyl)phenyl)-N-(1-(3-(4-(methylsulfonyl)phenyl)-3-phenylpropyl)piperidin-4-yl)acetamide | CHEMBL211866
Type:
Small organic molecule
Emp. Form.:
C32H40N2O5S2
Mol. Mass.:
596.8
SMILES:
CCN(C1CCN(CC[C@@H](c2ccccc2)c2ccc(cc2)S(C)(=O)=O)CC1)C(=O)Cc1ccc(cc1)S(C)(=O)=O
: