Target
Delta-type opioid receptor
Ligand
BDBM50185794
Substrate
Meas. Tech.
ChEMBL_372755 (CHEMBL871099)
Ki
>5000±n/a nM
Citation
 Bignan, GCBattista, KConnolly, PJOrsini, MJLiu, JMiddleton, SAReitz, AB 3-(4-Piperidinyl)indoles and 3-(4-piperidinyl)pyrrolo-[2,3-b]pyridines as ligands for the ORL-1 receptor. Bioorg Med Chem Lett 16:3524-8 (2006)  
Target
Name:
Delta-type opioid receptor
Synonyms:
D-OR-1 Delta opioid receptor OPIATE Delta OPRD1 OPRK1 | opioid receptor, delta 1
Type:
G Protein-Coupled Receptor (GPCR)
Mol. Mass.:
40382.98
Organism:
Homo sapiens (Human)
Description:
Competition binding assays were carried out using membrane preparations from transfected HN9.10 cells that constitutively expressed the delta opioid receptor.
Residue:
372
  
Inhibitor
Name:
BDBM50185794
Synonyms:
5-fluoro-3-(1-(naphthalen-1-ylmethyl)piperidin-4-yl)-1H-indole | CHEMBL378458
Type:
Small organic molecule
Emp. Form.:
C24H23FN2
Mol. Mass.:
358.4512
SMILES:
Fc1ccc2[nH]cc(C3CCN(Cc4cccc5ccccc45)CC3)c2c1
: