Target
Long-chain fatty acid transport protein 4
Ligand
BDBM50186001
Substrate
Meas. Tech.
ChEMBL_372182 (CHEMBL870441)
IC50
1200±n/a nM
Citation
 Blackburn, CGuan, BBrown, JCullis, CCondon, SMJenkins, TJPeluso, SYe, YGimeno, REPunreddy, SSun, YWu, HHubbard, BKaushik, VTummino, PSanchetti, PYu Sun, DDaniels, TTozzo, EBalani, SKRaman, P Identification and characterization of 4-aryl-3,4-dihydropyrimidin-2(1H)-ones as inhibitors of the fatty acid transporter FATP4. Bioorg Med Chem Lett 16:3504-9 (2006)  
Target
Name:
Long-chain fatty acid transport protein 4
Synonyms:
ACSVL4 Fatty acid transport protein 4 SLC27A4
Type:
PROTEIN
Mol. Mass.:
72079.54
Organism:
Homo sapiens (Human)
Description:
ChEMBL_372182
Residue:
643
  
Inhibitor
Name:
BDBM50186001
Synonyms:
CHEMBL436931 | cycloheptyl 6-methyl-4-(4-nitrophenyl)-2-oxo-1,2,3,4-tetrahydropyrimidine-5-carboxylate
Type:
Small organic molecule
Emp. Form.:
C19H23N3O5
Mol. Mass.:
373.403
SMILES:
CC1=NC(=O)NC(C1C(=O)OC1CCCCCC1)c1ccc(cc1)[N+]([O-])=O
: