Target
Malonyl-CoA decarboxylase, mitochondrial
Ligand
BDBM50186066
Substrate
Meas. Tech.
ChEMBL_371874 (CHEMBL871585)
IC50
526±n/a nM
Citation
 Cheng, JFMak, CCHuang, YPenuliar, RNishimoto, MZhang, LChen, MWallace, DArrhenius, TChu, DYang, GBarbosa, MBarr, RDyck, JRLopaschuk, GDNadzan, AM Heteroaryl substituted bis-trifluoromethyl carbinols as malonyl-CoA decarboxylase inhibitors. Bioorg Med Chem Lett 16:3484-8 (2006)  
Target
Name:
Malonyl-CoA decarboxylase, mitochondrial
Synonyms:
DCMC_HUMAN Malonyl-CoA decarboxylase
Type:
PROTEIN
Mol. Mass.:
55018.37
Organism:
Homo sapiens (Human)
Description:
ChEMBL_665404
Residue:
493
  
Inhibitor
Name:
BDBM50186066
Synonyms:
CHEMBL211056 | N-butyl-N-(5-(1,1,1,3,3,3-hexafluoro-2-hydroxypropan-2-yl)thiazol-2-yl)butyramide
Type:
Small organic molecule
Emp. Form.:
C14H18F6N2O2S
Mol. Mass.:
392.36
SMILES:
CCCCN(C(=O)CCC)c1ncc(s1)C(O)(C(F)(F)F)C(F)(F)F
: