Target
Motilin receptor
Ligand
BDBM50186108
Substrate
Meas. Tech.
ChEMBL_369517 (CHEMBL865377)
IC50
8±n/a nM
Citation
 Johnson, SGGunnet, JWMoore, JBMiller, WWines, PRivero, RACombs, DDemarest, KT Synthesis and SAR of 1,3-disubstituted cyclohexylmethyl urea and amide derivatives as non-peptidic motilin receptor antagonists. Bioorg Med Chem Lett 16:3362-6 (2006)  
Target
Name:
Motilin receptor
Synonyms:
G-protein coupled receptor 38 MLNR MTLR1 | MTLR_HUMAN
Type:
PROTEIN
Mol. Mass.:
45365.95
Organism:
Homo sapiens (Human)
Description:
ChEMBL_122664
Residue:
412
  
Inhibitor
Name:
BDBM50186108
Synonyms:
CHEMBL209301 | N-(((1S,3R)-3-(N-benzylpivalamido)cyclohexyl)methyl)-4-fluoro-N-(3-(2-(pyrrolidin-1-yl)ethoxy)phenyl)benzamide
Type:
Small organic molecule
Emp. Form.:
C38H48FN3O3
Mol. Mass.:
613.8044
SMILES:
CC(C)(C)C(=O)N(Cc1ccccc1)[C@@H]1CCC[C@H](CN(C(=O)c2ccc(F)cc2)c2cccc(OCCN3CCCC3)c2)C1
: