Target
Melanocortin receptor 4
Ligand
BDBM50186130
Substrate
Meas. Tech.
ChEMBL_371315 (CHEMBL865536)
Ki
35±n/a nM
Citation
 Briner, KCollado, IFisher, MJGarcía-Paredes, CHusain, SKuklish, SLMateo, AIO'Brien, TPOrnstein, PLZgombick, Jde Frutos, O Privileged structure based ligands for melanocortin-4 receptors--aliphatic piperazine derivatives. Bioorg Med Chem Lett 16:3449-53 (2006)  
Target
Name:
Melanocortin receptor 4
Synonyms:
MC4-R MC4R_HUMAN Melanocortin receptor 4 (MC-4) Melanocortin receptor 4 (MC4R)
Type:
Enzyme
Mol. Mass.:
36949.50
Organism:
Homo sapiens (Human)
Description:
P32245
Residue:
332
  
Inhibitor
Name:
BDBM50186130
Synonyms:
CHEMBL211078 | N-((R)-3-(4-chlorophenyl)-1-(4-(dicyclohexylmethyl)piperazin-1-yl)-1-oxopropan-2-yl)-2-(indolin-2-yl)acetamide
Type:
Small organic molecule
Emp. Form.:
C36H49ClN4O2
Mol. Mass.:
605.253
SMILES:
Clc1ccc(C[C@@H](NC(=O)CC2Cc3ccccc3N2)C(=O)N2CCN(CC2)C(C2CCCCC2)C2CCCCC2)cc1
: