Target
Cyclin-dependent kinase 2
Ligand
BDBM50186418
Substrate
Meas. Tech.
ChEMBL_377581 (CHEMBL869293)
IC50
247±n/a nM
Citation
 Huang, SConnolly, PJLin, REmanuel, SMiddleton, SA Synthesis and evaluation of N-acyl sulfonamides as potential prodrugs of cyclin-dependent kinase inhibitor JNJ-7706621. Bioorg Med Chem Lett 16:3639-41 (2006)  
Target
Name:
Cyclin-dependent kinase 2
Synonyms:
CDK2 CDK2_HUMAN Cell division protein kinase 2 Protein cereblon/Cyclin-dependent kinase 2 | p33 protein kinase
Type:
Enzyme Subunit
Mol. Mass.:
33938.17
Organism:
Homo sapiens (Human)
Description:
P24941
Residue:
298
  
Inhibitor
Name:
BDBM50186418
Synonyms:
CHEMBL210581 | N-(4-(5-amino-1-(2,6-difluorobenzoyl)-1H-1,2,4-triazol-3-ylamino)phenylsulfonyl)-2-(2-methoxyethoxy)acetamide
Type:
Small organic molecule
Emp. Form.:
C20H20F2N6O6S
Mol. Mass.:
510.471
SMILES:
COCCOCC(=O)NS(=O)(=O)c1ccc(Nc2nc(N)n(n2)C(=O)c2c(F)cccc2F)cc1
: