Target
Group 10 secretory phospholipase A2
Ligand
BDBM50186585
Substrate
Meas. Tech.
ChEMBL_352641 (CHEMBL860951)
IC50
75±n/a nM
Citation
 Smart, BPOslund, RCWalsh, LAGelb, MH The first potent inhibitor of mammalian group X secreted phospholipase A2: elucidation of sites for enhanced binding. J Med Chem 49:2858-60 (2006)  
Target
Name:
Group 10 secretory phospholipase A2
Synonyms:
Group X secretory phospholipase A2 Pla2g10
Type:
PROTEIN
Mol. Mass.:
17005.09
Organism:
Mus musculus
Description:
ChEMBL_537139
Residue:
151
  
Inhibitor
Name:
BDBM50186585
Synonyms:
2-(3-(2-amino-2-oxoacetyl)-1-benzyl-2-ethyl-6-methyl-1H-indol-4-yloxy)acetic acid | CHEMBL208315
Type:
Small organic molecule
Emp. Form.:
C22H22N2O5
Mol. Mass.:
394.4205
SMILES:
CCc1c(C(=O)C(N)=O)c2c(OCC(O)=O)cc(C)cc2n1Cc1ccccc1
: