Target
Inhibitor of nuclear factor kappa-B kinase subunit beta
Ligand
BDBM50186634
Substrate
Meas. Tech.
ChEMBL_353243 (CHEMBL865082)
IC50
12600±n/a nM
Citation
 Morwick, TBerry, ABrickwood, JCardozo, MCatron, KDeTuri, MEmeigh, JHomon, CHrapchak, MJacober, SJakes, SKaplita, PKelly, TAKsiazek, JLiuzzi, MMagolda, RMao, CMarshall, DMcNeil, DProkopowicz, ASarko, CScouten, ESledziona, CSun, SWatrous, JWu, JPCywin, CL Evolution of the thienopyridine class of inhibitors of IkappaB kinase-beta: part I: hit-to-lead strategies. J Med Chem 49:2898-908 (2006)  
Target
Name:
Inhibitor of nuclear factor kappa-B kinase subunit beta
Synonyms:
I-kappa-B Kinase 2 (IKK-beta) I-kappa-B-kinase beta IKBKB IKK-beta IKK2/IKK1 IKKB_HUMAN Inhibitor of nuclear factor kappa B kinase beta subunit Nuclear factor NF-kappa-B inhibitor kinase beta
Type:
Serine/threonine-protein kinase
Mol. Mass.:
86554.39
Organism:
Homo sapiens (Human)
Description:
GST-tagged IKK-2 was expressed in High Five cells and purified.
Residue:
756
  
Inhibitor
Name:
BDBM50186634
Synonyms:
3-amino-benzo[b]thiophene-2-carboxylic acid amide | CHEMBL211002
Type:
Small organic molecule
Emp. Form.:
C9H8N2OS
Mol. Mass.:
192.238
SMILES:
NC(=O)c1sc2ccccc2c1N
: