Target
Cytochrome P450 3A4
Ligand
BDBM50186624
Substrate
Meas. Tech.
ChEMBL_353252 (CHEMBL861848)
IC50
>30000±n/a nM
Citation
 Morwick, TBerry, ABrickwood, JCardozo, MCatron, KDeTuri, MEmeigh, JHomon, CHrapchak, MJacober, SJakes, SKaplita, PKelly, TAKsiazek, JLiuzzi, MMagolda, RMao, CMarshall, DMcNeil, DProkopowicz, ASarko, CScouten, ESledziona, CSun, SWatrous, JWu, JPCywin, CL Evolution of the thienopyridine class of inhibitors of IkappaB kinase-beta: part I: hit-to-lead strategies. J Med Chem 49:2898-908 (2006)  
Target
Name:
Cytochrome P450 3A4
Synonyms:
Albendazole monooxygenase CP3A4_HUMAN CYP3A4 CYPIIIA4 Cytochrome P450 3A4 (CYP3A4) Nifedipine oxidase Taurochenodeoxycholate 6-alpha-hydroxylase
Type:
Enzyme
Mol. Mass.:
57349.57
Organism:
Homo sapiens (Human)
Description:
Residue:
503
  
Inhibitor
Name:
BDBM50186624
Synonyms:
3-amino-4,6-dimethylthieno[2,3-b]pyridine-2-carboxamide | CHEMBL377085
Type:
Small organic molecule
Emp. Form.:
C10H11N3OS
Mol. Mass.:
221.279
SMILES:
Cc1cc(C)c2c(N)c(sc2n1)C(N)=O
: