Target
Tissue alpha-L-fucosidase
Ligand
BDBM50186736
Substrate
Meas. Tech.
ChEMBL_353427 (CHEMBL861361)
pH
6.8±n/a
Ki
>1000000±n/a nM
Comments
extracted
Citation
 Wang, RWQiu, XLBols, MOrtega-Caballero, FQing, FL Synthesis and biological evaluation of glycosidase inhibitors: gem-difluoromethylenated nojirimycin analogues. J Med Chem 49:2989-97 (2006)  
Target
Name:
Tissue alpha-L-fucosidase
Synonyms:
Alpha-L-fucosidase I FUCA1 Tissue alpha-L-fucosidase
Type:
PROTEIN
Mol. Mass.:
53690.69
Organism:
Homo sapiens (Human)
Description:
ChEMBL_34088
Residue:
466
  
Inhibitor
Name:
BDBM50186736
Synonyms:
CHEMBL380311 | L-1,4-dideoxy-4,4-difluorogulonojirimycin
Type:
Small organic molecule
Emp. Form.:
C6H11F2NO3
Mol. Mass.:
183.1532
SMILES:
OC[C@@H]1NC[C@@H](O)[C@@H](O)C1(F)F
: