Target
S-ribosylhomocysteine lyase
Ligand
BDBM50186746
Substrate
Meas. Tech.
ChEMBL_353579 (CHEMBL861694)
Ki
12700±n/a nM
Citation
 Shen, GRajan, RZhu, JBell, CEPei, D Design and synthesis of substrate and intermediate analogue inhibitors of S-ribosylhomocysteinase. J Med Chem 49:3003-11 (2006)  
Target
Name:
S-ribosylhomocysteine lyase
Synonyms:
LUXS_ECOLI ygaG
Type:
PROTEIN
Mol. Mass.:
19410.45
Organism:
Escherichia coli (strain K12)
Description:
ChEMBL_353579
Residue:
171
  
Inhibitor
Name:
BDBM50186746
Synonyms:
(2S)-2-AMINO-4-[(2R,3R)-2,3-DIHYDROXY-3-N-HYDROXYCARBAMOYL-PROPYLMERCAPTO]BUTYRIC ACID CHEMBL208091
Type:
Small organic molecule
Emp. Form.:
C8H16N2O6S
Mol. Mass.:
268.287
SMILES:
N[C@@H](CCSC[C@H](O)[C@@H](O)C(=O)NO)C(O)=O
: