Target
N-formyl peptide receptor 2
Ligand
BDBM50186956
Substrate
Meas. Tech.
ChEMBL_376306 (CHEMBL867962)
EC50
150±n/a nM
Citation
 Bürli, RWXu, HZou, XMuller, KGolden, JFrohn, MAdlam, MPlant, MHWong, MMcElvain, MRegal, KViswanadhan, VNTagari, PHungate, R Potent hFPRL1 (ALXR) agonists as potential anti-inflammatory agents. Bioorg Med Chem Lett 16:3713-8 (2006)  
Target
Name:
N-formyl peptide receptor 2
Synonyms:
ALXR, FPRL1, FPR2 FPR2 FPRH1 Formyl Peptide Receptor-Like 1 LXA4 receptor Lipoxin A4 receptor RFP | hFPRL
Type:
G Protein-Coupled Receptor (GPCR)
Mol. Mass.:
38968.35
Organism:
Homo sapiens (Human)
Description:
P25090
Residue:
351
  
Inhibitor
Name:
BDBM50186956
Synonyms:
1-(3-isopropyl-2-methyl-5-oxo-1-(pyrimidin-5-yl)-2,5-dihydro-1H-pyrazol-4-yl)-3-(4-(trifluoromethyl)phenyl)urea | CHEMBL211555
Type:
Small organic molecule
Emp. Form.:
C19H19F3N6O2
Mol. Mass.:
420.3884
SMILES:
CC(C)c1c(NC(=O)Nc2ccc(cc2)C(F)(F)F)c(=O)n(-c2cncnc2)n1C
: