Target
N-formyl peptide receptor 2
Ligand
BDBM50186962
Substrate
Meas. Tech.
ChEMBL_376306 (CHEMBL867962)
EC50
540±n/a nM
Citation
 Bürli, RWXu, HZou, XMuller, KGolden, JFrohn, MAdlam, MPlant, MHWong, MMcElvain, MRegal, KViswanadhan, VNTagari, PHungate, R Potent hFPRL1 (ALXR) agonists as potential anti-inflammatory agents. Bioorg Med Chem Lett 16:3713-8 (2006)  
Target
Name:
N-formyl peptide receptor 2
Synonyms:
ALXR, FPRL1, FPR2 FPR2 FPRH1 Formyl Peptide Receptor-Like 1 LXA4 receptor Lipoxin A4 receptor RFP | hFPRL
Type:
G Protein-Coupled Receptor (GPCR)
Mol. Mass.:
38968.35
Organism:
Homo sapiens (Human)
Description:
P25090
Residue:
351
  
Inhibitor
Name:
BDBM50186962
Synonyms:
1-(4-chlorophenyl)-3-(1-(4,5-dihydrothiazol-2-yl)-3-isopropyl-2-methyl-5-oxo-2,5-dihydro-1H-pyrazol-4-yl)urea | CHEMBL377130
Type:
Small organic molecule
Emp. Form.:
C17H20ClN5O2S
Mol. Mass.:
393.891
SMILES:
CC(C)c1c(NC(=O)Nc2ccc(Cl)cc2)c(=O)n(C2=NCCS2)n1C
: