Target
N-formyl peptide receptor 2
Ligand
BDBM50186970
Substrate
Meas. Tech.
ChEMBL_376306 (CHEMBL867962)
EC50
100±n/a nM
Citation
 Bürli, RWXu, HZou, XMuller, KGolden, JFrohn, MAdlam, MPlant, MHWong, MMcElvain, MRegal, KViswanadhan, VNTagari, PHungate, R Potent hFPRL1 (ALXR) agonists as potential anti-inflammatory agents. Bioorg Med Chem Lett 16:3713-8 (2006)  
Target
Name:
N-formyl peptide receptor 2
Synonyms:
ALXR, FPRL1, FPR2 FPR2 FPRH1 Formyl Peptide Receptor-Like 1 LXA4 receptor Lipoxin A4 receptor RFP | hFPRL
Type:
G Protein-Coupled Receptor (GPCR)
Mol. Mass.:
38968.35
Organism:
Homo sapiens (Human)
Description:
P25090
Residue:
351
  
Inhibitor
Name:
BDBM50186970
Synonyms:
1-(2,3-dimethyl-5-oxo-1-phenyl-2,5-dihydro-1H-pyrazol-4-yl)-3-(4-(trifluoromethyl)phenyl)urea | CHEMBL211885
Type:
Small organic molecule
Emp. Form.:
C19H17F3N4O2
Mol. Mass.:
390.3591
SMILES:
Cc1c(NC(=O)Nc2ccc(cc2)C(F)(F)F)c(=O)n(-c2ccccc2)n1C
: