Target
Metabotropic glutamate receptor 5
Ligand
BDBM50156069
Substrate
Meas. Tech.
ChEMBL_361059 (CHEMBL859181)
Ki
780±n/a nM
Citation
 de Paulis, THemstapat, KChen, YZhang, YSaleh, SAlagille, DBaldwin, RMTamagnan, GDConn, PJ Substituent effects of N-(1,3-diphenyl-1H-pyrazol-5-yl)benzamides on positive allosteric modulation of the metabotropic glutamate-5 receptor in rat cortical astrocytes. J Med Chem 49:3332-44 (2006)  
Target
Name:
Metabotropic glutamate receptor 5
Synonyms:
GRM5_RAT Grm5 Mglur5 metabotropic glutamate 5/1-C metabotropic glutamate 5a
Type:
Enzyme
Mol. Mass.:
131900.14
Organism:
Rattus norvegicus (Rat)
Description:
P31424
Residue:
1203
  
Inhibitor
Name:
BDBM50156069
Synonyms:
CHEMBL365409 N-(2,5-Diphenyl-2H-pyrazol-3-yl)-4-methyl-benzamide
Type:
Small organic molecule
Emp. Form.:
C23H19N3O
Mol. Mass.:
353.4165
SMILES:
Cc1ccc(cc1)C(=O)Nc1cc(nn1-c1ccccc1)-c1ccccc1
: