Target
Mast/stem cell growth factor receptor Kit
Ligand
BDBM50187996
Substrate
Meas. Tech.
ChEMBL_379522 (CHEMBL864253)
IC50
7±n/a nM
Citation
 Ji, ZAhmed, AAAlbert, DHBouska, JJBousquet, PFCunha, GAGlaser, KBGuo, JLi, JMarcotte, PAMoskey, MDPease, LJStewart, KDYates, MDavidsen, SKMichaelides, MR Isothiazolopyrimidines and isoxazolopyrimidines as novel multi-targeted inhibitors of receptor tyrosine kinases. Bioorg Med Chem Lett 16:4326-30 (2006)  
Target
Name:
Mast/stem cell growth factor receptor Kit
Synonyms:
CD117 antigen KIT Mast/stem cell growth factor receptor Kit (cKIT) Proto-oncogene tyrosine-protein kinase Kit Stem cell growth factor receptor Tyrosine-protein kinase Kit c-kit v-kit Hardy-Zuckerman 4 feline sarcoma viral oncogene homolog
Type:
Protein
Mol. Mass.:
109869.37
Organism:
Homo sapiens (Human)
Description:
P10721
Residue:
976
  
Inhibitor
Name:
BDBM50187996
Synonyms:
1-(4-(4-aminoisothiazolo[5,4-d]pyrimidin-3-yl)phenyl)-3-(2-fluoro-5-methylphenyl)urea | CHEMBL262433
Type:
Small organic molecule
Emp. Form.:
C19H15FN6OS
Mol. Mass.:
394.425
SMILES:
Cc1ccc(F)c(NC(=O)Nc2ccc(cc2)-c2nsc3ncnc(N)c23)c1
: