Target
Vascular endothelial growth factor receptor 2
Ligand
BDBM50188004
Substrate
Meas. Tech.
ChEMBL_379517 (CHEMBL864248)
IC50
>50000±n/a nM
Citation
 Ji, ZAhmed, AAAlbert, DHBouska, JJBousquet, PFCunha, GAGlaser, KBGuo, JLi, JMarcotte, PAMoskey, MDPease, LJStewart, KDYates, MDavidsen, SKMichaelides, MR Isothiazolopyrimidines and isoxazolopyrimidines as novel multi-targeted inhibitors of receptor tyrosine kinases. Bioorg Med Chem Lett 16:4326-30 (2006)  
Target
Name:
Vascular endothelial growth factor receptor 2
Synonyms:
CD_antigen=CD309 Fetal liver kinase 1 (FLK-1) KDR Protein-tyrosine kinase receptor Flk-1 VEGFR-2 VEGFR2 Vascular Endothelial Growth Factor Receptor Kinase 2 Vascular endothelial growth factor receptor 2 (KDR) Vascular endothelial growth factor receptor 2 (VEGFR2) Vascular endothelial growth factor receptor-2 (VEGFR-2)
Type:
Receptor Tyrosine Kinase
Mol. Mass.:
151510.97
Organism:
Homo sapiens (Human)
Description:
P35968
Residue:
1356
  
Inhibitor
Name:
BDBM50188004
Synonyms:
CHEMBL211379 | N-(4-(4-aminoisoxazolo[5,4-d]pyrimidin-3-yl)phenyl)benzamide
Type:
Small organic molecule
Emp. Form.:
C18H13N5O2
Mol. Mass.:
331.3281
SMILES:
Nc1ncnc2onc(-c3ccc(NC(=O)c4ccccc4)cc3)c12
: