Target
Vascular endothelial growth factor receptor 2
Ligand
BDBM50187995
Substrate
Meas. Tech.
ChEMBL_379517 (CHEMBL864248)
IC50
13±n/a nM
Citation
 Ji, ZAhmed, AAAlbert, DHBouska, JJBousquet, PFCunha, GAGlaser, KBGuo, JLi, JMarcotte, PAMoskey, MDPease, LJStewart, KDYates, MDavidsen, SKMichaelides, MR Isothiazolopyrimidines and isoxazolopyrimidines as novel multi-targeted inhibitors of receptor tyrosine kinases. Bioorg Med Chem Lett 16:4326-30 (2006)  
Target
Name:
Vascular endothelial growth factor receptor 2
Synonyms:
CD_antigen=CD309 Fetal liver kinase 1 (FLK-1) KDR Protein-tyrosine kinase receptor Flk-1 VEGFR-2 VEGFR2 Vascular Endothelial Growth Factor Receptor Kinase 2 Vascular endothelial growth factor receptor 2 (KDR) Vascular endothelial growth factor receptor 2 (VEGFR2) Vascular endothelial growth factor receptor-2 (VEGFR-2)
Type:
Receptor Tyrosine Kinase
Mol. Mass.:
151510.97
Organism:
Homo sapiens (Human)
Description:
P35968
Residue:
1356
  
Inhibitor
Name:
BDBM50187995
Synonyms:
1-(4-(4-aminoisothiazolo[5,4-d]pyrimidin-3-yl)phenyl)-3-m-tolylurea | CHEMBL376951
Type:
Small organic molecule
Emp. Form.:
C19H16N6OS
Mol. Mass.:
376.435
SMILES:
Cc1cccc(NC(=O)Nc2ccc(cc2)-c2nsc3ncnc(N)c23)c1
: