Target
Steroid 17-alpha-hydroxylase/17,20 lyase
Ligand
BDBM50188094
Substrate
Meas. Tech.
ChEMBL_382954 (CHEMBL866709)
IC50
3340±n/a nM
Citation
 Owen, CPDhanani, SPatel, CHShahid, IAhmed, S Synthesis and biochemical evaluation of a range of potent benzyl imidazole-based compounds as potential inhibitors of the enzyme complex 17alpha-hydroxylase/17,20-lyase (P450(17alpha)). Bioorg Med Chem Lett 16:4011-5 (2006)  
Target
Name:
Steroid 17-alpha-hydroxylase/17,20 lyase
Synonyms:
CP17A_RAT Cyp17a1 Cytochrome P450 17A1 Steroid 17-alpha-hydroxylase/17,20 lyase
Type:
Enzyme
Mol. Mass.:
57255.68
Organism:
Rattus norvegicus (Rat)
Description:
P11715
Residue:
507
  
Inhibitor
Name:
BDBM50188094
Synonyms:
1-(3,5-dichlorobenzyl)-1H-imidazole | CHEMBL210125
Type:
Small organic molecule
Emp. Form.:
C10H8Cl2N2
Mol. Mass.:
227.09
SMILES:
Clc1cc(Cl)cc(Cn2ccnc2)c1
: