Target
5-hydroxytryptamine receptor 2C
Ligand
BDBM50188143
Substrate
Meas. Tech.
ChEMBL_384996 (CHEMBL869818)
Ki
103±n/a nM
Citation
 Huck, BRLlamas, LRobarge, MJDent, TCSong, JHodnick, WFCrumrine, CStricker-Krongrad, AHarrington, JBrunden, KRBennani, YL The design and synthesis of a tricyclic single-nitrogen scaffold that serves as a 5-HT2C receptor agonist. Bioorg Med Chem Lett 16:4130-4 (2006)  
Target
Name:
5-hydroxytryptamine receptor 2C
Synonyms:
5-HT-2C 5-HT2C-INI 5-HTR2C 5-hydroxytryptamine receptor 2C (5-HT-2C) 5HT-1C HTR1C Serotonin (5-HT3) receptor Serotonin Receptor 2C
Type:
G Protein-Coupled Receptor (GPCR)
Mol. Mass.:
51836.79
Organism:
Homo sapiens (Human)
Description:
P28335
Residue:
458
  
Inhibitor
Name:
BDBM50188143
Synonyms:
(+/-)-(3aS,8aS)-5,6-dichloro-8-methyl-1,2,3,3a,8,8a-hexahydro-indeno[1,2-c]pyrrole | CHEMBL373787
Type:
Small organic molecule
Emp. Form.:
C12H13Cl2N
Mol. Mass.:
242.144
SMILES:
CC1[C@@H]2CNC[C@@H]2c2cc(Cl)c(Cl)cc12
: