Target
Vascular endothelial growth factor receptor 3
Ligand
BDBM50188272
Substrate
Meas. Tech.
ChEMBL_380308 (CHEMBL866109)
IC50
169±n/a nM
Citation
 Dinges, JAkritopoulou-Zanze, IArnold, LDBarlozzari, TBousquet, PFCunha, GAEricsson, AMIwasaki, NMichaelides, MROgawa, NPhelan, KMRafferty, PSowin, TJStewart, KDTokuyama, RXia, ZZhang, HQ Hit-to-lead optimization of 1,4-dihydroindeno[1,2-c]pyrazoles as a novel class of KDR kinase inhibitors. Bioorg Med Chem Lett 16:4371-5 (2006)  
Target
Name:
Vascular endothelial growth factor receptor 3
Synonyms:
FLT-4 Fms-like tyrosine kinase 4 VEGFR-3 VGFR3_HUMAN Vascular endothelial growth factor receptor 3 (VEGFR-3) | Vascular endothelial growth factor receptor 3 (VEGFR3)
Type:
Protein
Mol. Mass.:
152749.58
Organism:
Homo sapiens (Human)
Description:
P35916-2
Residue:
1363
  
Inhibitor
Name:
BDBM50188272
Synonyms:
7-((1H-imidazol-1-yl)methyl)-3-(thiophen-3-yl)-1,4-dihydroindeno[1,2-c]pyrazole | CHEMBL212084
Type:
Small organic molecule
Emp. Form.:
C18H14N4S
Mol. Mass.:
318.396
SMILES:
C(c1ccc2Cc3c(n[nH]c3-c3ccsc3)-c2c1)n1ccnc1
: