Target
Hepatocyte growth factor receptor
Ligand
BDBM50188266
Substrate
Meas. Tech.
ChEMBL_380315 (CHEMBL863748)
IC50
>50000±n/a nM
Citation
 Dinges, JAkritopoulou-Zanze, IArnold, LDBarlozzari, TBousquet, PFCunha, GAEricsson, AMIwasaki, NMichaelides, MROgawa, NPhelan, KMRafferty, PSowin, TJStewart, KDTokuyama, RXia, ZZhang, HQ Hit-to-lead optimization of 1,4-dihydroindeno[1,2-c]pyrazoles as a novel class of KDR kinase inhibitors. Bioorg Med Chem Lett 16:4371-5 (2006)  
Target
Name:
Hepatocyte growth factor receptor
Synonyms:
Hepatocyte growth factor receptor Hepatocyte growth factor receptor (c-MET) MET Met proto-oncogene (hepatocyte growth factor receptor) Tyrosine-protein kinase Met (c-Met) c-Met kinase
Type:
Protein
Mol. Mass.:
155559.73
Organism:
Homo sapiens (Human)
Description:
P08581
Residue:
1390
  
Inhibitor
Name:
BDBM50188266
Synonyms:
7-((4-methylpiperazin-1-yl)methyl)-3-(thiophen-3-yl)-1,4-dihydroindeno[1,2-c]pyrazole | CHEMBL213743
Type:
Small organic molecule
Emp. Form.:
C20H22N4S
Mol. Mass.:
350.48
SMILES:
CN1CCN(Cc2ccc3Cc4c(n[nH]c4-c4ccsc4)-c3c2)CC1
: