Target
Angiopoietin-1 receptor
Ligand
BDBM50188266
Substrate
Meas. Tech.
ChEMBL_380311 (CHEMBL866113)
IC50
47793±n/a nM
Citation
 Dinges, JAkritopoulou-Zanze, IArnold, LDBarlozzari, TBousquet, PFCunha, GAEricsson, AMIwasaki, NMichaelides, MROgawa, NPhelan, KMRafferty, PSowin, TJStewart, KDTokuyama, RXia, ZZhang, HQ Hit-to-lead optimization of 1,4-dihydroindeno[1,2-c]pyrazoles as a novel class of KDR kinase inhibitors. Bioorg Med Chem Lett 16:4371-5 (2006)  
Target
Name:
Angiopoietin-1 receptor
Synonyms:
TEK TIE2_HUMAN Tyrosine-protein kinase receptor (TIE-2) Tyrosine-protein kinase receptor TEK (p140 TEK) Tyrosine-protein kinase receptor TIE2/TEK VMCM1 p140 TEK
Type:
Enzyme
Mol. Mass.:
125835.70
Organism:
Homo sapiens (Human)
Description:
Q02763
Residue:
1124
  
Inhibitor
Name:
BDBM50188266
Synonyms:
7-((4-methylpiperazin-1-yl)methyl)-3-(thiophen-3-yl)-1,4-dihydroindeno[1,2-c]pyrazole | CHEMBL213743
Type:
Small organic molecule
Emp. Form.:
C20H22N4S
Mol. Mass.:
350.48
SMILES:
CN1CCN(Cc2ccc3Cc4c(n[nH]c4-c4ccsc4)-c3c2)CC1
: