Target
Vascular endothelial growth factor receptor 2
Ligand
BDBM50188281
Substrate
Meas. Tech.
ChEMBL_380316 (CHEMBL864892)
IC50
500±n/a nM
Citation
 Dinges, JAkritopoulou-Zanze, IArnold, LDBarlozzari, TBousquet, PFCunha, GAEricsson, AMIwasaki, NMichaelides, MROgawa, NPhelan, KMRafferty, PSowin, TJStewart, KDTokuyama, RXia, ZZhang, HQ Hit-to-lead optimization of 1,4-dihydroindeno[1,2-c]pyrazoles as a novel class of KDR kinase inhibitors. Bioorg Med Chem Lett 16:4371-5 (2006)  
Target
Name:
Vascular endothelial growth factor receptor 2
Synonyms:
CD_antigen=CD309 Fetal liver kinase 1 (FLK-1) KDR Protein-tyrosine kinase receptor Flk-1 VEGFR-2 VEGFR2 Vascular Endothelial Growth Factor Receptor Kinase 2 Vascular endothelial growth factor receptor 2 (KDR) Vascular endothelial growth factor receptor 2 (VEGFR2) Vascular endothelial growth factor receptor-2 (VEGFR-2)
Type:
Receptor Tyrosine Kinase
Mol. Mass.:
151510.97
Organism:
Homo sapiens (Human)
Description:
P35968
Residue:
1356
  
Inhibitor
Name:
BDBM50188281
Synonyms:
4-(6-((4-methylpiperazin-1-yl)methyl)-1,4-dihydroindeno[1,2-c]pyrazol-3-yl)phenol | CHEMBL413581
Type:
Small organic molecule
Emp. Form.:
C22H24N4O
Mol. Mass.:
360.4522
SMILES:
CN1CCN(Cc2ccc-3c(Cc4c(n[nH]c-34)-c3ccc(O)cc3)c2)CC1
: