Target
Cathepsin K
Ligand
BDBM50188296
Substrate
Meas. Tech.
ChEMBL_379266 (CHEMBL853454)
Ki
1.3±n/a nM
Citation
 Setti, ELVenkatraman, SPalmer, JTXie, XCheung, HYu, WWesolowski, GRobichaud, J Design and synthesis of tetracyclic nonpeptidic biaryl nitrile inhibitors of cathepsin K. Bioorg Med Chem Lett 16:4296-9 (2006)  
Target
Name:
Cathepsin K
Synonyms:
CATK_HUMAN CTSO Cathepsin O Cathepsin X
Type:
Enzyme
Mol. Mass.:
36975.68
Organism:
Homo sapiens (Human)
Description:
P43235
Residue:
329
  
Inhibitor
Name:
BDBM50188296
Synonyms:
(R)-2-{3'-[2-(4-tert-butyl-piperazin-1-yl)-thiazol-4-yl]-biphenyl-3-yl}-4-methyl-pentanoic acid cyanomethyl-amide | CHEMBL212879
Type:
Small organic molecule
Emp. Form.:
C31H39N5OS
Mol. Mass.:
529.739
SMILES:
CC(C)C[C@@H](C(=O)NCC#N)c1cccc(c1)-c1cccc(c1)-c1csc(n1)N1CCN(CC1)C(C)(C)C
: