Target
Prostaglandin D2 receptor 2
Ligand
BDBM50188299
Substrate
Meas. Tech.
ChEMBL_378634 (CHEMBL868656)
IC50
11±n/a nM
Citation
 Birkinshaw, TNTeague, SJBeech, CBonnert, RVHill, SPatel, AReakes, SSanganee, HDougall, IGPhillips, TTSalter, SSchmidt, JArrowsmith, ECCarrillo, JJBell, FMPaine, SWWeaver, R Discovery of potent CRTh2 (DP2) receptor antagonists. Bioorg Med Chem Lett 16:4287-90 (2006)  
Target
Name:
Prostaglandin D2 receptor 2
Synonyms:
CD_antigen=CD294 Chemoattractant Receptor-homologous molecule expressed on T-helper type 2 cells (CRTH2) Chemoattractant receptor-homologous molecule expressed on Th2 cells (CRTH2) G protein-coupled receptor 44 GPR44 PTGDR2 Prostaglandin D2 receptor 2 | Prostaglandin D2 receptor 2 (PGD2)
Type:
Enzyme
Mol. Mass.:
43295.45
Organism:
Homo sapiens (Human)
Description:
Q9Y5Y4
Residue:
395
  
Inhibitor
Name:
BDBM50188299
Synonyms:
2-(3-(8-methoxyquinolin-4-yl)-2,5-dimethyl-1H-indol-1-yl)acetic acid | CHEMBL211631
Type:
Small organic molecule
Emp. Form.:
C22H20N2O3
Mol. Mass.:
360.4058
SMILES:
COc1cccc2c(ccnc12)-c1c(C)n(CC(O)=O)c2ccc(C)cc12
: