Target
Sodium- and chloride-dependent glycine transporter 1
Ligand
BDBM50188363
Substrate
Meas. Tech.
ChEMBL_378748 (CHEMBL871493)
EC50
24±n/a nM
Citation
 Alberati, DHainzl, DJolidon, SKrafft, EAKurt, AMaier, APinard, EThomas, AWZimmerli, D Discovery of 4-substituted-8-(2-hydroxy-2-phenyl-cyclohexyl)-2,8-diaza-spiro[4.5]decan-1-one as a novel class of highly selective GlyT1 inhibitors with improved metabolic stability. Bioorg Med Chem Lett 16:4311-5 (2006)  
Target
Name:
Sodium- and chloride-dependent glycine transporter 1
Synonyms:
GlyT-1 Glycine Transporters (GlyT1c) SC6A9_HUMAN Sodium- and chloride-dependent glycine transporter 1 Sodium- and chloride-dependent glycine transporter 1 (GlyT1c) Solute carrier family 6 member 9
Type:
Enzyme
Mol. Mass.:
78270.54
Organism:
Homo sapiens (Human)
Description:
P48067
Residue:
706
  
Inhibitor
Name:
BDBM50188363
Synonyms:
8-[2-(4-fluoro-phenyl)-2-hydroxy-cyclohexyl]-1-phenyl-1,3,8-triaza-spiro[4.5]decan-4-one | CHEMBL385360
Type:
Small organic molecule
Emp. Form.:
C25H30FN3O2
Mol. Mass.:
423.523
SMILES:
OC1(CCCCC1N1CCC2(CC1)N(CNC2=O)c1ccccc1)c1ccc(F)cc1
: