Target
Sodium- and chloride-dependent glycine transporter 1
Ligand
BDBM50188364
Substrate
Meas. Tech.
ChEMBL_378748 (CHEMBL871493)
EC50
70±n/a nM
Citation
 Alberati, DHainzl, DJolidon, SKrafft, EAKurt, AMaier, APinard, EThomas, AWZimmerli, D Discovery of 4-substituted-8-(2-hydroxy-2-phenyl-cyclohexyl)-2,8-diaza-spiro[4.5]decan-1-one as a novel class of highly selective GlyT1 inhibitors with improved metabolic stability. Bioorg Med Chem Lett 16:4311-5 (2006)  
Target
Name:
Sodium- and chloride-dependent glycine transporter 1
Synonyms:
GlyT-1 Glycine Transporters (GlyT1c) SC6A9_HUMAN Sodium- and chloride-dependent glycine transporter 1 Sodium- and chloride-dependent glycine transporter 1 (GlyT1c) Solute carrier family 6 member 9
Type:
Enzyme
Mol. Mass.:
78270.54
Organism:
Homo sapiens (Human)
Description:
P48067
Residue:
706
  
Inhibitor
Name:
BDBM50188364
Synonyms:
8-[2-(4-fluoro-phenyl)-2-hydroxy-cyclohexyl]-4-phenyl-2,8-diaza-spiro[4.5]decan-1-one | CHEMBL214122
Type:
Small organic molecule
Emp. Form.:
C26H31FN2O2
Mol. Mass.:
422.5349
SMILES:
OC1(CCCCC1N1CCC2(CC1)C(CNC2=O)c1ccccc1)c1ccc(F)cc1
: