Target
11-beta-hydroxysteroid dehydrogenase type 2
Ligand
BDBM50188387
Substrate
Meas. Tech.
ChEMBL_362615 (CHEMBL853224)
IC50
6040±n/a nM
Citation
 Schuster, DMaurer, EMLaggner, CNashev, LGWilckens, TLanger, TOdermatt, A The discovery of new 11beta-hydroxysteroid dehydrogenase type 1 inhibitors by common feature pharmacophore modeling and virtual screening. J Med Chem 49:3454-66 (2006)  
Target
Name:
11-beta-hydroxysteroid dehydrogenase type 2
Synonyms:
11-DH2 11-beta-Hydroxysteroid Dehydrogenase 2 (11-beta-HSD2) 11-beta-hydroxysteroid dehydrogenase 2 11-beta-hydroxysteroid dehydrogenase type 2 (11-beta-HSD2) DHI2_HUMAN HSD11K SDR9C3
Type:
Enzyme
Mol. Mass.:
44141.72
Organism:
Homo sapiens (Human)
Description:
Purified recombinant human 11beta-HSD2.
Residue:
405
  
Inhibitor
Name:
BDBM50188387
Synonyms:
(2S,4aS,6aS,6bR,8aR,10S,12aS,12bR,14bR)-10-amino-2,4a,6a,6b,9,9,12a-heptamethyl-13-oxo-1,2,3,4,4a,5,6,6a,6b,7,8,8a,9,10,11,12,12a,12b,13,14b-icosahydropicene-2-carboxylic acid | CHEMBL425772
Type:
Small organic molecule
Emp. Form.:
C30H47NO3
Mol. Mass.:
469.6991
SMILES:
CC1(C)[C@@H](N)CC[C@@]2(C)[C@H]1CC[C@]1(C)[C@@H]2C(=O)C=C2[C@@H]3C[C@](C)(CC[C@]3(C)CC[C@@]12C)C(O)=O
: