Target
Thromboxane A2 receptor
Ligand
BDBM50188612
Substrate
Meas. Tech.
ChEMBL_364276 (CHEMBL863214)
IC50
0.72±n/a nM
Citation
 Hanson, JReynaud, DQiao, NDevel, PMoray, ALRenard, JFKelley, LPWinum, JYMontero, JLKinsella, BTPirotte, BPace-Asciak, CRDogné, JM Synthesis and pharmacological evaluation of novel nitrobenzenic thromboxane modulators as antiplatelet agents acting on both the alpha and beta isoforms of the human thromboxane receptor. J Med Chem 49:3701-9 (2006)  
Target
Name:
Thromboxane A2 receptor
Synonyms:
Prostanoid TP receptor TBXA2R Thromboxane Thromboxane Beta
Type:
Enyzme
Mol. Mass.:
37445.28
Organism:
Homo sapiens (Human)
Description:
P21731
Residue:
343
  
Inhibitor
Name:
BDBM50188612
Synonyms:
CHEMBL208818 | N-n-hexyl-N'-[2-(4-methylphenoxy)-5-nitrobenzenesulfonyl]urea
Type:
Small organic molecule
Emp. Form.:
C20H25N3O6S
Mol. Mass.:
435.494
SMILES:
CCCCCCNC(=O)NS(=O)(=O)c1cc(ccc1Oc1ccc(C)cc1)[N+]([O-])=O
: