Target
Vascular endothelial growth factor receptor 1
Ligand
BDBM50188739
Substrate
Meas. Tech.
ChEMBL_390502 (CHEMBL869848)
IC50
2897±n/a nM
Citation
 Dinges, JAshworth, KLAkritopoulou-Zanze, IAkritopolou-Zanze, IArnold, LDBaumeister, SABousquet, PFCunha, GADavidsen, SKDjuric, SWGracias, VJMichaelides, MRRafferty, PSowin, TJStewart, KDXia, ZZhang, HQ 1,4-Dihydroindeno[1,2-c]pyrazoles as novel multitargeted receptor tyrosine kinase inhibitors. Bioorg Med Chem Lett 16:4266-71 (2006)  
Target
Name:
Vascular endothelial growth factor receptor 1
Synonyms:
FLT FRT Fms-like tyrosine kinase 1 Tyrosine-protein kinase FRT VEGFR-1 VGFR1_HUMAN Vascular endothelial growth factor receptor 1 (FLT1) Vascular endothelial growth factor receptor 1 and 2 (Flt-1 and KDR) Vascular permeability factor receptor vascular endothelial growth factor/vascular permeability factor receptor
Type:
Receptor Tyrosine Kinase
Mol. Mass.:
150800.23
Organism:
Homo sapiens (Human)
Description:
P17948
Residue:
1338
  
Inhibitor
Name:
BDBM50188739
Synonyms:
1-((5-(6-((4-methylpiperazin-1-yl)methyl)-1,4-dihydroindeno[1,2-c]pyrazol-3-yl)thiophen-2-yl)methyl)-3-m-tolylurea | CHEMBL213507
Type:
Small organic molecule
Emp. Form.:
C29H32N6OS
Mol. Mass.:
512.669
SMILES:
CN1CCN(Cc2ccc-3c(Cc4c-3n[nH]c4-c3ccc(CNC(=O)Nc4cccc(C)c4)s3)c2)CC1
: