Target
Mast/stem cell growth factor receptor Kit
Ligand
BDBM50188748
Substrate
Meas. Tech.
ChEMBL_390503 (CHEMBL869849)
IC50
17±n/a nM
Citation
 Dinges, JAshworth, KLAkritopoulou-Zanze, IAkritopolou-Zanze, IArnold, LDBaumeister, SABousquet, PFCunha, GADavidsen, SKDjuric, SWGracias, VJMichaelides, MRRafferty, PSowin, TJStewart, KDXia, ZZhang, HQ 1,4-Dihydroindeno[1,2-c]pyrazoles as novel multitargeted receptor tyrosine kinase inhibitors. Bioorg Med Chem Lett 16:4266-71 (2006)  
Target
Name:
Mast/stem cell growth factor receptor Kit
Synonyms:
CD117 antigen KIT Mast/stem cell growth factor receptor Kit (cKIT) Proto-oncogene tyrosine-protein kinase Kit Stem cell growth factor receptor Tyrosine-protein kinase Kit c-kit v-kit Hardy-Zuckerman 4 feline sarcoma viral oncogene homolog
Type:
Protein
Mol. Mass.:
109869.37
Organism:
Homo sapiens (Human)
Description:
P10721
Residue:
976
  
Inhibitor
Name:
BDBM50188748
Synonyms:
1-((5-(6-((4-methylpiperazin-1-yl)methyl)-1,4-dihydroindeno[1,2-c]pyrazol-3-yl)thiophen-2-yl)methyl)-3-(3-(trifluoromethyl)phenyl)urea | CHEMBL212986
Type:
Small organic molecule
Emp. Form.:
C29H29F3N6OS
Mol. Mass.:
566.64
SMILES:
CN1CCN(Cc2ccc-3c(Cc4c-3n[nH]c4-c3ccc(CNC(=O)Nc4cccc(c4)C(F)(F)F)s3)c2)CC1
: